Target
cAMP and cAMP-inhibited cGMP 3',5'-cyclic phosphodiesterase 10A
Ligand
BDBM156311
Substrate
Meas. Tech.
Inhibition Assay
Temperature
298.15±n/a K
IC50
1500±n/a nM
Comments
extracted
Citation
 Ritzen, ALanggard, MKehler, JNielsen, JKilburn, JPFarah, MM Phenylimidazole derivatives as PDE10A enzyme inhibitors US Patent  US9018217 Publication Date 4/28/2015 
Target
Name:
cAMP and cAMP-inhibited cGMP 3',5'-cyclic phosphodiesterase 10A
Synonyms:
3',5'-cyclic phosphodiesterase PDE10A Phosphodiesterase 10 (PDE10) | Phosphodiesterase 10A
Type:
Protein
Mol. Mass.:
88412.52
Organism:
Homo sapiens (Human)
Description:
Q9Y233
Residue:
1055
  
Inhibitor
Name:
BDBM156311
Synonyms:
US9018217, 2-[2-(1-Amino-4-phenyl-1H-imidazol-2-ylsulfanylmethyl)-6-chloro-benzoimidazol-1-yl]-ethanol | US9592230, 2-[2-(1-Amino-4-phenyl-1H-imidazol-2-ylsulfanylmethyl)-6-chloro-benzoimidazol-1-yl]-ethanol
Type:
Small organic molecule
Emp. Form.:
C19H18ClN5OS
Mol. Mass.:
399.897
SMILES:
Nn1cc(nc1SCc1nc2ccc(Cl)cc2n1CCO)-c1ccccc1
: