Target
Apoptosis regulator Bcl-2
Ligand
BDBM156380
Substrate
Meas. Tech.
Fluorescence Polarization
IC50
0.5±n/a nM
Citation
 Diebold, RBGero, TGrover, PHuang, SIoannidis, SOgoe, CASaeh, JC Chemical compounds US Patent  US9018381 Publication Date 4/28/2015 
Target
Name:
Apoptosis regulator Bcl-2
Synonyms:
Apoptosis regulator Bcl-2 Protein BCL-2 BCL2_HUMAN | Bcl-2 Protein
Type:
Homodimer or heterodimer
Mol. Mass.:
26269.11
Organism:
Homo sapiens (Human)
Description:
P10415
Residue:
239
  
Inhibitor
Name:
BDBM156380
Synonyms:
US9018381, 4 | US9248140, 4
Type:
Small organic molecule
Emp. Form.:
C46H50ClF3N4O7S3
Mol. Mass.:
959.555
SMILES:
CCN(CCO)CC[C@H](CSc1ccccc1)Nc1ccc(cc1S(=O)(=O)C(F)(F)F)S(=O)(=O)NC(=O)c1ccc(cc1)N1CCC(CC1)[C@@H](O)c1ccccc1-c1ccc(Cl)cc1
: