Target
Apoptosis regulator Bcl-2
Ligand
BDBM156384
Substrate
Meas. Tech.
Fluorescence Polarization
IC50
2±n/a nM
Citation
 Diebold, RBGero, TGrover, PHuang, SIoannidis, SOgoe, CASaeh, JC Chemical compounds US Patent  US9018381 Publication Date 4/28/2015 
Target
Name:
Apoptosis regulator Bcl-2
Synonyms:
Apoptosis regulator Bcl-2 Protein BCL-2 BCL2_HUMAN | Bcl-2 Protein
Type:
Homodimer or heterodimer
Mol. Mass.:
26269.11
Organism:
Homo sapiens (Human)
Description:
P10415
Residue:
239
  
Inhibitor
Name:
BDBM156384
Synonyms:
US9018381, 7 | US9248140, 7
Type:
Small organic molecule
Emp. Form.:
C46H52ClF3N4O14P2S3
Mol. Mass.:
1135.514
SMILES:
O[C@H](C1CCN(CC1)c1ccc(cc1)C(=O)NS(=O)(=O)c1ccc(N[C@H](CCN(CCOP(O)(O)=O)CCOP(O)(O)=O)CSc2ccccc2)c(c1)S(=O)(=O)C(F)(F)F)c1ccccc1-c1ccc(Cl)cc1
: