Target
Enteropeptidase
Ligand
BDBM158112
Substrate
Meas. Tech.
Inhibition Assay
pH
8±n/a
Ki
6.66±n/a nM
Comments
extracted
Citation
 Koshiba, TTokumasu, MIchimaru, TOhsumi, KNakagawa, TYamada, TMatsumoto, KSuzuki, T Heteroarylcarboxylic acid ester derivative US Patent  US9024044 Publication Date 5/5/2015 
Target
Name:
Enteropeptidase
Synonyms:
ENTK PRSS7 | TMPRSS15
Type:
Enzyme
Mol. Mass.:
112901.62
Organism:
Homo sapiens (Human)
Description:
P98073
Residue:
1019
  
Inhibitor
Name:
BDBM158112
Synonyms:
US9024044, 40 US9655879, 40
Type:
Small organic molecule
Emp. Form.:
C22H21FN4O4S
Mol. Mass.:
456.49
SMILES:
CC(C)(Cc1ccc(s1)C(=O)Oc1ccc(cc1F)C(N)=N)C(=O)Nc1ccc[nH]c1=O
: