Target
Trace amine-associated receptor 1
Ligand
BDBM158209
Substrate
Meas. Tech.
Radioligand Binding Assay
pH
7.4±n/a
Temperature
310.15±n/a K
Ki
1±n/a nM
Comments
extracted
Citation
 Galley, GNorcross, RPflieger, P Substituted benzamide derivatives US Patent  US9029370 Publication Date 5/12/2015 
Target
Name:
Trace amine-associated receptor 1
Synonyms:
TAAR1_MOUSE Taar1 Trace amine receptor 1 (TARR1) Trace amine-associated receptor1 | Trar1
Type:
Protein
Mol. Mass.:
37635.41
Organism:
Mus musculus (Mouse)
Description:
Q923Y8
Residue:
332
  
Inhibitor
Name:
BDBM158209
Synonyms:
US9029370, 1
Type:
Small organic molecule
Emp. Form.:
C18H16F2N4O2
Mol. Mass.:
358.342
SMILES:
Fc1ccc2c(n[nH]c2c1)C(=O)Nc1ccc(cc1F)[C@@H]1CNCCO1
: