Target
Trace amine-associated receptor 1
Ligand
BDBM158284
Substrate
Meas. Tech.
Radioligand Binding Assay
pH
7.4±n/a
Temperature
310.15±n/a K
Ki
1.2±n/a nM
Comments
extracted
Citation
 Galley, GNorcross, RPflieger, P Substituted benzamide derivatives US Patent  US9029370 Publication Date 5/12/2015 
Target
Name:
Trace amine-associated receptor 1
Synonyms:
TAAR1_MOUSE Taar1 Trace amine receptor 1 (TARR1) Trace amine-associated receptor1 | Trar1
Type:
Protein
Mol. Mass.:
37635.41
Organism:
Mus musculus (Mouse)
Description:
Q923Y8
Residue:
332
  
Inhibitor
Name:
BDBM158284
Synonyms:
US9029370, 78
Type:
Small organic molecule
Emp. Form.:
C19H20F3N3O3
Mol. Mass.:
395.3756
SMILES:
FC(F)Oc1cccc(CNC(=O)Nc2ccc(cc2F)[C@H]2CNCCO2)c1
: