Target
Trace amine-associated receptor 1
Ligand
BDBM158288
Substrate
Meas. Tech.
Radioligand Binding Assay
pH
7.4±n/a
Temperature
310.15±n/a K
Ki
1.3±n/a nM
Comments
extracted
Citation
 Galley, GNorcross, RPflieger, P Substituted benzamide derivatives US Patent  US9029370 Publication Date 5/12/2015 
Target
Name:
Trace amine-associated receptor 1
Synonyms:
TAAR1_MOUSE Taar1 Trace amine receptor 1 (TARR1) Trace amine-associated receptor1 | Trar1
Type:
Protein
Mol. Mass.:
37635.41
Organism:
Mus musculus (Mouse)
Description:
Q923Y8
Residue:
332
  
Inhibitor
Name:
BDBM158288
Synonyms:
US9029370, 82
Type:
Small organic molecule
Emp. Form.:
C21H17F3N4O4
Mol. Mass.:
446.3793
SMILES:
Fc1cc(ccc1NC(=O)c1cnn(c1)-c1ccc2OC(F)(F)Oc2c1)[C@H]1CNCCO1
: