Target
Trace amine-associated receptor 1
Ligand
BDBM158213
Substrate
Meas. Tech.
Radioligand Binding Assay
pH
7.4±n/a
Temperature
310.15±n/a K
Ki
1.3±n/a nM
Comments
extracted
Citation
 Galley, GNorcross, RPflieger, P Substituted benzamide derivatives US Patent  US9029370 Publication Date 5/12/2015 
Target
Name:
Trace amine-associated receptor 1
Synonyms:
TAAR1_RAT Taar1 Trace amine receptor 1 (TARR1) Trace amine-associated receptor 1 (TAAR1) Trar1
Type:
Enzyme
Mol. Mass.:
38034.73
Organism:
Rattus norvegicus (Rat)
Description:
Q923Y9
Residue:
332
  
Inhibitor
Name:
BDBM158213
Synonyms:
US9029370, 5
Type:
Small organic molecule
Emp. Form.:
C18H17ClN4O2
Mol. Mass.:
356.806
SMILES:
Clc1cc(ccc1NC(=O)Nc1cccc(c1)C#N)C1CNCCO1
: