Target
Trace amine-associated receptor 1
Ligand
BDBM158253
Substrate
Meas. Tech.
Radioligand Binding Assay
pH
7.4±n/a
Temperature
310.15±n/a K
Ki
1.2±n/a nM
Comments
extracted
Citation
 Galley, GNorcross, RPflieger, P Substituted benzamide derivatives US Patent  US9029370 Publication Date 5/12/2015 
Target
Name:
Trace amine-associated receptor 1
Synonyms:
TAAR1_RAT Taar1 Trace amine receptor 1 (TARR1) Trace amine-associated receptor 1 (TAAR1) Trar1
Type:
Enzyme
Mol. Mass.:
38034.73
Organism:
Rattus norvegicus (Rat)
Description:
Q923Y9
Residue:
332
  
Inhibitor
Name:
BDBM158253
Synonyms:
US9029370, 47
Type:
Small organic molecule
Emp. Form.:
C19H17ClF2N4O3
Mol. Mass.:
422.813
SMILES:
FC(F)Oc1ccc(cc1NC(=O)Nc1ccc(cc1Cl)[C@@H]1CNCCO1)C#N
: