Target
Trace amine-associated receptor 1
Ligand
BDBM158333
Substrate
Meas. Tech.
Radioligand Binding Assay
pH
7.4±n/a
Temperature
310.15±n/a K
Ki
1.6±n/a nM
Comments
extracted
Citation
 Galley, GNorcross, RPflieger, P Substituted benzamide derivatives US Patent  US9029370 Publication Date 5/12/2015 
Target
Name:
Trace amine-associated receptor 1
Synonyms:
TAAR1_RAT Taar1 Trace amine receptor 1 (TARR1) Trace amine-associated receptor 1 (TAAR1) Trar1
Type:
Enzyme
Mol. Mass.:
38034.73
Organism:
Rattus norvegicus (Rat)
Description:
Q923Y9
Residue:
332
  
Inhibitor
Name:
BDBM158333
Synonyms:
US9029370, 127
Type:
Small organic molecule
Emp. Form.:
C19H16F4N6O2
Mol. Mass.:
436.363
SMILES:
Fc1cc(NC(=O)c2cnn(c2)-c2cncc(n2)C(F)(F)F)ccc1[C@H]1CNCCO1
: