Target
Methyl-CpG-binding protein 2
Ligand
BDBM158509
Substrate
Meas. Tech.
Binding Assay
IC50
>200000±n/a nM
Citation
 Nelson, WGYegnasubramanian, SLin, XSpeed, TJReichert, Z Agents for reversing epigenetic silencing of genes US Patent  US9034574 Publication Date 5/19/2015 
Target
Name:
Methyl-CpG-binding protein 2
Synonyms:
MECP2 Small conductance calcium-activated potassium channel protein 3
Type:
Mol. Mass.:
52482.84
Organism:
Homo sapiens (Human)
Description:
P51608
Residue:
486
  
Inhibitor
Name:
BDBM158509
Synonyms:
US9034574, XVIII
Type:
Small organic molecule
Emp. Form.:
C15H12BrN3O2S
Mol. Mass.:
378.244
SMILES:
COc1cc(O)cc(Br)c1\C=N\Nc1nc2ccccc2s1
: