Target
Sodium-dependent serotonin transporter
Ligand
BDBM159337
Substrate
Meas. Tech.
Radioligand Binding Assay
pH
7.5±n/a
Temperature
277.15±n/a K
IC50
4.9±n/a nM
Comments
extracted
Citation
 Liu, SMolino, BFNacro, K Aryl, heteroaryl, and heterocycle substituted tetrahydroisoquinolines and use thereof US Patent  US9034899 Publication Date 5/19/2015 
Target
Name:
Sodium-dependent serotonin transporter
Synonyms:
5-HT Transporter 5HTT SC6A4_HUMAN SLC6A4 Serotonin transporter (5HTT) Sodium-dependent serotonin transporter (SERT) | Solute carrier family 6 member 4
Type:
Multi-pass membrane protein
Mol. Mass.:
70322.51
Organism:
Homo sapiens (Human)
Description:
P31645
Residue:
630
  
Inhibitor
Name:
BDBM159337
Synonyms:
US9034899, 25 | US9604960, 25
Type:
Small organic molecule
Emp. Form.:
C20H18Cl2N2O
Mol. Mass.:
373.276
SMILES:
Cc1noc(C)c1-c1ccc2C(CNCc2c1)c1ccc(Cl)c(Cl)c1
: