Target
Gonadotropin-releasing hormone receptor
Ligand
BDBM160321
Substrate
Meas. Tech.
FLIPR Calcium Assay
Temperature
310.15±n/a K
IC50
2±n/a nM
Comments
extracted
Citation
 Ohno, KMiyagi, TOzawa, TFushimi, N Fused heterocyclic derivative, medicinal composition containing the same, and medicinal use thereof US Patent  US9040693 Publication Date 5/26/2015 
Target
Name:
Gonadotropin-releasing hormone receptor
Synonyms:
GNRHR GRHR GnRH-R Gonadotropin-releasing hormone receptor | Gonadotropin-releasing hormone receptor (GnRH)
Type:
Enzyme
Mol. Mass.:
37749.45
Organism:
Homo sapiens (Human)
Description:
P30968
Residue:
328
  
Inhibitor
Name:
BDBM160321
Synonyms:
US9040693, 22
Type:
Small organic molecule
Emp. Form.:
C22H16ClN3O6S2
Mol. Mass.:
517.962
SMILES:
OC(=O)c1scc2[nH]c(=O)n(-c3cc(ccc3Cl)S(=O)(=O)N3CCCc4ccccc34)c(=O)c12
: