Target
Caspase-7
Ligand
BDBM160832
Substrate
Meas. Tech.
Fluorometric Enzymatic Assay
Temperature
310.15±n/a K
IC50
>3330±n/a nM
Comments
extracted
Citation
 Ahlfors, JMekouar, K Selective caspase inhibitors and uses thereof US Patent  US9045524 Publication Date 6/2/2015 
Target
Name:
Caspase-7
Synonyms:
Apoptotic protease Mch-3 CASP7 CMH-1 MCH3 | caspase 7, apoptosis-related cysteine peptidase
Type:
Enzyme
Mol. Mass.:
34273.91
Organism:
Homo sapiens (Human)
Description:
P55210
Residue:
303
  
Inhibitor
Name:
BDBM160832
Synonyms:
US9045524, 101
Type:
Small organic molecule
Emp. Form.:
C33H42N4O11S
Mol. Mass.:
702.772
SMILES:
COC(=O)C[C@H](NC(=O)[C@@H](NC(=O)[C@@H](NC(=O)[C@H](CC(=O)OC)NC(=O)OCc1ccccc1)c1ccccc1)C(C)C)\C=C\S(C)(=O)=O
: