Target
Kappa-type opioid receptor
Ligand
BDBM162698
Substrate
Meas. Tech.
Radioligand Dose-Displacement Binding Assay
pH
7.4±n/a
Temperature
298.15±n/a K
Ki
42.53±n/a nM
Comments
extracted
Citation
 Lockman, JPark, JHTafesse, LYao, JYu, J Benzomorphan analogs and the use thereof US Patent  US9056836 Publication Date 6/16/2015 
Target
Name:
Kappa-type opioid receptor
Synonyms:
K-OR-1 Kappa-opioid receptor (KOR) Kappa-type opioid receptor (KOR) OPIATE Kappa OPRK1 kappa opioid receptor (KOR)
Type:
G Protein-Coupled Receptor (GPCR)
Mol. Mass.:
42648.76
Organism:
Homo sapiens (Human)
Description:
P41145
Residue:
380
  
Inhibitor
Name:
BDBM162698
Synonyms:
US9056836, 12
Type:
Small organic molecule
Emp. Form.:
C24H32N2O4
Mol. Mass.:
412.5219
SMILES:
CN(C)C(=O)CCC[C@]12CCN(CC3CC3)[C@H](Cc3ccc(O)cc13)\C2=C/C(O)=O
: