Target
Cannabinoid receptor 2
Ligand
BDBM163042
Substrate
Meas. Tech.
Radioligand Binding Assay
IC50
5.4±n/a nM
Citation
 Chen, JPettit, SFliri, H Cannabinoid-2 agonists US Patent  US9062004 Publication Date 6/23/2015 
Target
Name:
Cannabinoid receptor 2
Synonyms:
CANNABINOID CB2 CB2 CB2B CNR2_HUMAN Cannabinoid CB2 receptor Cannabinoid receptor 2 (CB2R) | hCB2
Type:
G Protein-Coupled Receptor (GPCR)
Mol. Mass.:
39690.94
Organism:
Homo sapiens (Human)
Description:
P34972
Residue:
360
  
Inhibitor
Name:
BDBM163042
Synonyms:
US9062004, 5 | US9670216, 13 4-Bromo-5-propylamino-2-(3,3,5,5-tetramethylcyclohexyl)pyridazin-3-one
Type:
Small organic molecule
Emp. Form.:
C17H28ClN3O
Mol. Mass.:
325.877
SMILES:
CCCNc1cnn(C2CC(C)(C)CC(C)(C)C2)c(=O)c1Cl
: