Target
C-C chemokine receptor-like 2
Ligand
BDBM163490
Substrate
Meas. Tech.
Receptor Binding Assay
IC50
240±n/a nM
Citation
 Lanter, JCMarkotan, TPSubasinghe, NSui, Z Cyclohexyl-azetidinyl antagonists of CCR2 US Patent  US9062048 Publication Date 6/23/2015 
Target
Name:
C-C chemokine receptor-like 2
Synonyms:
CCR11 CCRL2 CKRX HCR | Monocyte chemotactic protein-1 (MCP-1)
Type:
Protein
Mol. Mass.:
39518.98
Organism:
Homo sapiens (Human)
Description:
O00421
Residue:
344
  
Inhibitor
Name:
BDBM163490
Synonyms:
US9062048, 116
Type:
Small organic molecule
Emp. Form.:
C21H27F3N6O
Mol. Mass.:
436.4739
SMILES:
NC[C@H]1CC[C@H](CC1)N1CC(C1)NC(=O)CNc1ncnc2ccc(cc12)C(F)(F)F
: