Target
AN1-type domain-containing protein
Ligand
BDBM50199883
Substrate
Meas. Tech.
Activity-based Protein Profiling (ABPP)
pH
7.4±0
Temperature
310.15±0 K
IC50
8.1e+3± 2.0e+3 nM
Citation
 Wolf, EVZeissler, AVerhelst, SH Inhibitor Fingerprinting of Rhomboid Proteases by Activity-Based Protein Profiling Reveals Inhibitor Selectivity and Rhomboid Autoprocessing. ACS Chem Biol 10:2325-33 (2015)  
Target
Name:
AN1-type domain-containing protein
Synonyms:
Rhomboid protease (AfROM)
Type:
Protein
Mol. Mass.:
37476.98
Organism:
Archaeoglobus fulgidus (AfROM)
Description:
O29251
Residue:
330
  
Inhibitor
Name:
BDBM50199883
Synonyms:
3,4‐Dichloroisocoumarin (2) 3,4-dichloro-1H-isochromen-1-one CHEMBL24983 | cid_1609
Type:
Small organic molecule
Emp. Form.:
C9H4Cl2O2
Mol. Mass.:
215.033
SMILES:
Clc1oc(=O)c2ccccc2c1Cl
: