Target
Rhomboid domain-containing protein
Ligand
BDBM165194
Substrate
Meas. Tech.
Activity-based Protein Profiling (ABPP)
pH
7.4±0
Temperature
310.15±0 K
IC50
2.5e+4± 1.0e+4 nM
Citation
 Wolf, EVZeissler, AVerhelst, SH Inhibitor Fingerprinting of Rhomboid Proteases by Activity-Based Protein Profiling Reveals Inhibitor Selectivity and Rhomboid Autoprocessing. ACS Chem Biol 10:2325-33 (2015)  
Target
Name:
Rhomboid domain-containing protein
Synonyms:
Rhomboid protease (PhROM)
Type:
Protein
Mol. Mass.:
22001.99
Organism:
Pyrococcus horikoshii (Euryarchaeotes)
Description:
O59166
Residue:
197
  
Inhibitor
Name:
BDBM165194
Synonyms:
4‐Chloro‐7‐nitro‐3‐[(5‐phenylpentyl)oxy]isochromen‐1‐one (21)
Type:
Small organic molecule
Emp. Form.:
C20H18ClNO5
Mol. Mass.:
387.814
SMILES:
[O-][N+](=O)c1ccc2c(Cl)c(OCCCCCc3ccccc3)oc(=O)c2c1
: