Target
Lipopolysaccharide-induced tumor necrosis factor-alpha factor
Ligand
BDBM135814
Substrate
Meas. Tech.
TNF inhibition assay
IC50
20000±n/a nM
Citation
 Mjalli, AMGaddam, BPolisetti, DRKostura, MJGuzel, M Tricyclic compounds as modulators of TNF-α synthesis and as PDE4 inhibitors US Patent  US10085990 Publication Date 10/2/2018 
Target
Name:
Lipopolysaccharide-induced tumor necrosis factor-alpha factor
Synonyms:
LITAF LPS-induced TNF-alpha factor SIMPLE TNF-alpha | p53-induced gene 7 protein
Type:
Enzyme Catalytic Domain
Mol. Mass.:
17106.57
Organism:
Homo sapiens (Human)
Description:
TNF-alpha 0 HUMAN::Q99732
Residue:
161
  
Inhibitor
Name:
BDBM135814
Synonyms:
US10085990, Example 33 US8853226, 33 US9833457, 33
Type:
Small organic molecule
Emp. Form.:
C21H25N3O2
Mol. Mass.:
351.4421
SMILES:
CCn1c(=O)n(C2CCCC2)c2c3cccc(C(C)C)c3ncc2c1=O
: