Target
Potassium voltage-gated channel subfamily H member 2
Ligand
BDBM168619
Substrate
Meas. Tech.
In Vitro Binding Assay
Ki
13000±n/a nM
Citation
 Liotta, DCSnyder, JPTraynelis, SFWilson, LMosley, CDingledine, RJMyers, STahirovic, YA NMDA receptor antagonists for neuroprotection US Patent  US9079852 Publication Date 7/14/2015 
Target
Name:
Potassium voltage-gated channel subfamily H member 2
Synonyms:
1,3-beta-glucan synthase component GLS2 ERG Eag-related protein 1 Ether-a-go-go-related gene (HERG) Ether-a-go-go-related gene potassium channel 1 Ether-a-go-go-related gene potassium channel 1 (hERG1) Ether-a-go-go-related protein 1 H-ERG KCNH2 Potassium voltage-gated channel subfamily H member 2 (hERG) Voltage-gated potassium channel subunit Kv11.1 hERG Potassium Channel 1 | putative potassium channel subunit
Type:
Multi-pass membrane protein
Mol. Mass.:
126672.65
Organism:
Homo sapiens (Human)
Description:
Q12809
Residue:
1159
  
Inhibitor
Name:
BDBM168619
Synonyms:
US9079852, Table F, Compound 4
Type:
Small organic molecule
Emp. Form.:
C20H25ClN4O3
Mol. Mass.:
404.891
SMILES:
NC(=O)Nc1ccc(OC[C@@H](O)CN2CCN(CC2)c2ccc(Cl)cc2)cc1
: