Target
Arachidonate 5-lipoxygenase-activating protein
Ligand
BDBM168764
Substrate
Meas. Tech.
Homogeneous Time Resolved Fluorescence Assay
Ki
1±n/a nM
Citation
 Bacani, GMEccles, WFitzgerald, AEGoldberg, SDHack, MDHawryluk, NAJones, WMKeith, JMKrawczuk, PLebsack, ADLee-Dutra, ALiu, JMcClure, KJMeduna, SPPippel, DJRosen, MDSales, ZS Flap modulators US Patent  US9079866 Publication Date 7/14/2015 
Target
Name:
Arachidonate 5-lipoxygenase-activating protein
Synonyms:
5-lipoxygenase activating protein 5-lipoxygenase/FLAP ALOX5AP MK-886-binding protein
Type:
Enzyme
Mol. Mass.:
18159.90
Organism:
Homo sapiens (Human)
Description:
P20292
Residue:
161
  
Inhibitor
Name:
BDBM168764
Synonyms:
US9079866, 158 US9884878, Compound 158
Type:
Small organic molecule
Emp. Form.:
C25H21FN4O3S
Mol. Mass.:
476.523
SMILES:
Nc1cnc(cn1)-c1ccc(cc1F)-c1ccccc1S(=O)(=O)N[C@@H]1[C@@H](O)Cc2ccccc12
: