Target
Sodium-dependent serotonin transporter
Ligand
BDBM60509
Substrate
Meas. Tech.
Binding Assay
pH
7.4±n/a
Ki
21.3±n/a nM
Comments
extracted
Citation
 Molino, BFLiu, SGuzzo, PRBeck, JP Aryl- and heteroaryl-substituted tetrahydroisoquinolines and use thereof to block reuptake of norepinephrine, dopamine, and serotonin US Patent  US9085531 Publication Date 7/21/2015 
Target
Name:
Sodium-dependent serotonin transporter
Synonyms:
5-HT Transporter 5HTT SC6A4_HUMAN SLC6A4 Serotonin transporter (5HTT) Sodium-dependent serotonin transporter (SERT) | Solute carrier family 6 member 4
Type:
Multi-pass membrane protein
Mol. Mass.:
70322.51
Organism:
Homo sapiens (Human)
Description:
P31645
Residue:
630
  
Inhibitor
Name:
BDBM60509
Synonyms:
US9085531, 125
Type:
Emp. Form.:
C17H16ClN3
Mol. Mass.:
297.782
SMILES:
CN1Cc2ccccc2C(C1Cl)c1ccc2[nH]ncc2c1
: