Target
Sodium-dependent dopamine transporter
Ligand
BDBM287972
Substrate
Meas. Tech.
Assay for Dopamine Reuptake Inhibition
pH
7.4±n/a
EC50
16.0±3 nM
Comments
extracted
Citation
 Ananthan, SRothman, RB Quinazolines as biogenic amine transport modulators US Patent  US10087148 Publication Date 10/2/2018 
Target
Name:
Sodium-dependent dopamine transporter
Synonyms:
DA transporter DAT1 Dopamine transporter protein (DAT) SC6A3_HUMAN Sodium-dependent dopamine transporter Solute carrier family 6 member 3
Type:
Multi-pass membrane protein
Mol. Mass.:
68497.11
Organism:
Homo sapiens (Human)
Description:
Q01959
Residue:
620
  
Inhibitor
Name:
BDBM287972
Synonyms:
N-(4-(4-((2,2- diphenylpropyl)amino)quinazolin-2- yl)phenyl)methanesulfonamide | US10087148, Example 39
Type:
Small organic molecule
Emp. Form.:
C30H28N4O2S
Mol. Mass.:
508.634
SMILES:
CC(CNc1nc(nc2ccccc12)-c1ccc(NS(C)(=O)=O)cc1)(c1ccccc1)c1ccccc1
: