Target
Opioid growth factor receptor-like protein 1
Ligand
BDBM172377
Substrate
Meas. Tech.
Radioligand Binding Assay
pH
7.4±n/a
Temperature
298.15±n/a K
Ki
37.9±4.1 nM
Comments
extracted
Citation
 Yamawaki, KYao, JYu, JZhou, X Substituted benzimidazole-type piperidine compounds and uses thereof US Patent  US9090618 Publication Date 7/28/2015 
Target
Name:
Opioid growth factor receptor-like protein 1
Synonyms:
OGFRL1 Opioid Receptor-Like Receptor (ORL-1) Opioid growth factor receptor-like protein 1 (ORL1) Opioid receptor-like (ORL1) Opioid receptor-like receptor (ORL1)
Type:
Protein
Mol. Mass.:
51247.53
Organism:
Homo sapiens (Human)
Description:
Q5TC84
Residue:
451
  
Inhibitor
Name:
BDBM172377
Synonyms:
US9090618, E30c(ii) | US9598411, Ref. No. E30c(ii)
Type:
Small organic molecule
Emp. Form.:
C31H46N4O2
Mol. Mass.:
506.7225
SMILES:
OC(=O)CN1CCC[C@@H]1c1nc2ccccc2n1[C@@H]1C[C@@H]2CCC[C@H](C1)N2C1CCCCCCCCC1
: