Target
P2X purinoceptor 7
Ligand
BDBM173409
Substrate
Meas. Tech.
FLIPR Assay
pH
7.4±n/a
IC50
127.9±n/a nM
Comments
extracted
Citation
 Alcazar Vaca, MJAndres Gil, JILetavic, MARudolph, DAShireman, BTStenne, BMZiff, JM P2X7 modulators US Patent  US9096596 Publication Date 8/4/2015 
Target
Name:
P2X purinoceptor 7
Synonyms:
ATP receptor P2X purinoceptor 7 P2X purinoceptor 7 (P2X7) P2X7 rat P2rx7 | Purinergic receptor
Type:
Protein
Mol. Mass.:
68403.50
Organism:
Rattus norvegicus (Rat)
Description:
Q64663
Residue:
595
  
Inhibitor
Name:
BDBM173409
Synonyms:
US10323032, Example 122 US9604982, Example 122
Type:
Small organic molecule
Emp. Form.:
C18H14Cl2FN5O
Mol. Mass.:
406.241
SMILES:
C[C@H]1N(CCc2c1ncnc2-c1ccn[nH]1)C(=O)c1ccc(Cl)c(F)c1Cl
: