Target
Dihydroorotate dehydrogenase (quinone), mitochondrial
Ligand
BDBM50018006
Substrate
Meas. Tech.
Inhibiton Assay
pH
8±n/a
IC50
22±n/a nM
Comments
extracted
Citation
 Rathod, PKFloyd, DBurrows, JMarwaha, AGujjar, RCoteron-Lopez, JPhillips, MCharman, SAMatthews, D Antimalarial agents that are inhibitors of dihydroorotate dehydrogenase US Patent  US9238653 Publication Date 1/19/2016 
Target
Name:
Dihydroorotate dehydrogenase (quinone), mitochondrial
Synonyms:
DHOdehase Dihydroorotate dehydrogenase homolog PYRD_PLAF7
Type:
Enzyme
Mol. Mass.:
65581.88
Organism:
Plasmodium falciparum (isolate 3D7)
Description:
Q08210
Residue:
569
  
Inhibitor
Name:
BDBM50018006
Synonyms:
CHEMBL3289672 | US9238653, Table 5, Compound 49
Type:
Small organic molecule
Emp. Form.:
C14H7F8N5
Mol. Mass.:
397.2261
SMILES:
Cc1cc(Nc2cc(F)c(c(F)c2)C(F)(F)F)n2nc(nc2n1)C(F)(F)F
: