Target
P2X purinoceptor 7
Ligand
BDBM173667
Substrate
Meas. Tech.
Binding Assay
pH
7.4±n/a
Temperature
298.15±n/a K
IC50
1.3±n/a nM
Comments
extracted
Citation
 Kilburn, JPRasmussen, LKJessing, MEldemenky, EMChen, BJiang, YHopper, AT Benzamides US Patent  US9102591 Publication Date 8/11/2015 
Target
Name:
P2X purinoceptor 7
Synonyms:
ATP receptor P2RX7_HUMAN P2X purinoceptor 7 (P2X7) P2Z receptor | Purinergic receptor
Type:
Protein
Mol. Mass.:
68602.85
Organism:
Homo sapiens (Human)
Description:
Q99572
Residue:
595
  
Inhibitor
Name:
BDBM173667
Synonyms:
US9102591, 2,3-dichloro-N-((1-(6-cyclopropylpyridin-3-yl)-4,4-difluorocyclohexyl)methyl)benzamide | US9649308, 2,3-dichloro-N-((1-(6-cyclopropylpyridin-3-yl)-4,4-difluorocyclohexyl)methyl)benzamide
Type:
Small organic molecule
Emp. Form.:
C22H22Cl2F2N2O
Mol. Mass.:
439.326
SMILES:
FC1(F)CCC(CNC(=O)c2cccc(Cl)c2Cl)(CC1)c1ccc(nc1)C1CC1
: