Target
Rho-associated protein kinase 1/2
Ligand
BDBM148425
Substrate
Meas. Tech.
MLC Phosphorylation Assay
EC50
<100±n/a nM
Citation
 Boland, SBourin, ADefert, OLeysen, D Pyridine derivatives as soft rock inhibitors US Patent  US9682963 Publication Date 6/20/2017 
Target
Name:
Rho-associated protein kinase 1/2
Synonyms:
ROCK Complex
Type:
Protein
Mol. Mass.:
Description:
Components:
This complex has 2 components.
Component 1
Name:
Rho-associated protein kinase 1
Synonyms:
Liver regenerat ion-related protein LRRG199 ROCK1_RAT Rho-associated protein kinase 1 (ROCK I) Rho-kinase (ROCK I) p150 RhoA-binding kinase ROK beta | p160 ROCK-1
Type:
Protein
Mol. Mass.:
159610.34
Organism:
Rattus norvegicus (Rat)
Description:
Q63644
Residue:
1369
  
Component 2
Name:
Rho-associated protein kinase 2
Synonyms:
ROCK2_RAT Rho-associated protein kinase 2 Rho-associated, coiled-coil-containing protein kinase 2 RhoA-binding kinase 2 p150 ROK-alpha
Type:
Protein
Mol. Mass.:
160370.90
Organism:
Rattus norvegicus (Rat)
Description:
Q62868
Residue:
1388
  
Inhibitor
Name:
BDBM148425
Synonyms:
US9682963, 13
Type:
Small organic molecule
Emp. Form.:
C30H26FN5O4
Mol. Mass.:
539.5569
SMILES:
NCc1ccc(cc1-c1cccc(NC(=O)c2ccc(NC3CCOC3=O)cc2)c1)C(=O)Nc1ccncc1F
: