Target
Macrophage colony-stimulating factor 1 receptor
Ligand
BDBM174917
Substrate
Meas. Tech.
Biochemical Assay
pH
7.5±n/a
Temperature
303.15±n/a K
IC50
<100±n/a nM
Comments
extracted
Citation
 Zhang, JIbrahim, PNBremer, RSpevak, WCho, H Compounds and methods for kinase modulation, and indications therefor US Patent  US9096593 Publication Date 8/4/2015 
Target
Name:
Macrophage colony-stimulating factor 1 receptor
Synonyms:
CSF1R FMS Macrophage colony stimulating factor receptor Macrophage colony-stimulating factor 1 receptor (c-FMS) Proto-oncogene c-Fms c-fms | cFMS
Type:
Protein
Mol. Mass.:
107979.48
Organism:
Homo sapiens (Human)
Description:
P07333
Residue:
972
  
Inhibitor
Name:
BDBM174917
Synonyms:
US9096593, P-1646
Type:
Small organic molecule
Emp. Form.:
C21H16F5N5O
Mol. Mass.:
449.3767
SMILES:
COc1ncc(CNc2ccc(Cc3c[nH]c4ncc(cc34)C(F)(F)F)c(F)n2)cc1F
: