Target
Receptor-type tyrosine-protein kinase FLT3
Ligand
BDBM174917
Substrate
Meas. Tech.
Biochemical Assay
pH
7.5±n/a
Temperature
298.15±n/a K
IC50
<100±n/a nM
Comments
extracted
Citation
 Zhang, JIbrahim, PNBremer, RSpevak, WCho, H Compounds and methods for kinase modulation, and indications therefor US Patent  US9096593 Publication Date 8/4/2015 
Target
Name:
Receptor-type tyrosine-protein kinase FLT3
Synonyms:
CD135 FL cytokine receptor FLK2 FLT3 Fetal liver kinase-2 Fms-like tyrosine kinase 3 (Flt-3) STK-1 Stem cell tyrosine kinase 1
Type:
Enzyme
Mol. Mass.:
112888.62
Organism:
Homo sapiens (Human)
Description:
P36888
Residue:
993
  
Inhibitor
Name:
BDBM174917
Synonyms:
US9096593, P-1646
Type:
Small organic molecule
Emp. Form.:
C21H16F5N5O
Mol. Mass.:
449.3767
SMILES:
COc1ncc(CNc2ccc(Cc3c[nH]c4ncc(cc34)C(F)(F)F)c(F)n2)cc1F
: