Target
Mitogen-activated protein kinase 1 [T157A,D319N]
Ligand
BDBM176672
Substrate
Meas. Tech.
Fluorescence Quenching Assay
Kd
6400±300 nM
Citation
 Shapiro, PSMacKerell, Jr., ADFletcher, S Non-ATP dependent inhibitors of extracellular signal-regulated kinase (ERK) US Patent  US9115122 Publication Date 8/25/2015 
Target
Name:
Mitogen-activated protein kinase 1 [T157A,D319N]
Synonyms:
ERK2(T157A/D319N) MK01_MOUSE Mapk1 | Prkm1
Type:
Mol. Mass.:
41248.65
Organism:
Mus musculus (mouse)
Description:
P63085[T157A,D319N]
Residue:
358
  
Inhibitor
Name:
BDBM176672
Synonyms:
US9115122, 76
Type:
Small organic molecule
Emp. Form.:
C14H16N2O2S2
Mol. Mass.:
308.419
SMILES:
CCOc1ccc(\C=C2/SC(=S)N(CCN)C2=O)cc1
: