Target
Mitogen-activated protein kinase 1 [T157A,D319N]
Ligand
BDBM176674
Substrate
Meas. Tech.
Fluorescence Quenching Assay
Kd
>20000±n/a nM
Citation
 Shapiro, PSMacKerell, Jr., ADFletcher, S Non-ATP dependent inhibitors of extracellular signal-regulated kinase (ERK) US Patent  US9115122 Publication Date 8/25/2015 
Target
Name:
Mitogen-activated protein kinase 1 [T157A,D319N]
Synonyms:
ERK2(T157A/D319N) MK01_MOUSE Mapk1 | Prkm1
Type:
Mol. Mass.:
41248.65
Organism:
Mus musculus (mouse)
Description:
P63085[T157A,D319N]
Residue:
358
  
Inhibitor
Name:
BDBM176674
Synonyms:
US9115122, 76.3
Type:
Small organic molecule
Emp. Form.:
C13H12N2O3S2
Mol. Mass.:
308.376
SMILES:
NCCN1C(=S)S\C(=C/c2ccc3OCOc3c2)C1=O
: