Target
Mitogen-activated protein kinase 14
Ligand
BDBM176674
Substrate
Meas. Tech.
Fluorescence Quenching Assay
Kd
4500±1000 nM
Citation
 Shapiro, PSMacKerell, Jr., ADFletcher, S Non-ATP dependent inhibitors of extracellular signal-regulated kinase (ERK) US Patent  US9115122 Publication Date 8/25/2015 
Target
Name:
Mitogen-activated protein kinase 14
Synonyms:
Crk1 Csbp2 MAP kinase p38 Mapk14 Mitogen-activated protein kinase p38 alpha
Type:
Enzyme
Mol. Mass.:
41281.22
Organism:
Mus musculus (mouse)
Description:
The full-length open reading frame of murine p38 alpha was cloned and expressed in E. coli.. Soluble murine p38R was extracted from cell pellets and purified using ion-exchange chromatography.
Residue:
360
  
Inhibitor
Name:
BDBM176674
Synonyms:
US9115122, 76.3
Type:
Small organic molecule
Emp. Form.:
C13H12N2O3S2
Mol. Mass.:
308.376
SMILES:
NCCN1C(=S)S\C(=C/c2ccc3OCOc3c2)C1=O
: