Target
Mitogen-activated protein kinase 1 [Y191A]
Ligand
BDBM176676
Substrate
Meas. Tech.
Fluorescence Quenching Assay
Kd
130±n/a nM
Citation
 Shapiro, PSMacKerell, Jr., ADFletcher, S Non-ATP dependent inhibitors of extracellular signal-regulated kinase (ERK) US Patent  US9115122 Publication Date 8/25/2015 
Target
Name:
Mitogen-activated protein kinase 1 [Y191A]
Synonyms:
ERK2(Y191A) MK01_MOUSE Mapk1 | Prkm1
Type:
Mol. Mass.:
41186.56
Organism:
Mus musculus (mouse)
Description:
P63085[Y191A]
Residue:
358
  
Inhibitor
Name:
BDBM176676
Synonyms:
US9115122, 2.3.2
Type:
Small organic molecule
Emp. Form.:
C10H10O5S2
Mol. Mass.:
274.313
SMILES:
O=S(=O)(OC1CS(=O)(=O)C=C1)c1ccccc1
: