Target
Mitogen-activated protein kinase 1
Ligand
BDBM176679
Substrate
Meas. Tech.
Fluorescence Quenching Assay
Kd
9300±2000 nM
Citation
 Shapiro, PSMacKerell, Jr., ADFletcher, S Non-ATP dependent inhibitors of extracellular signal-regulated kinase (ERK) US Patent  US9115122 Publication Date 8/25/2015 
Target
Name:
Mitogen-activated protein kinase 1
Synonyms:
ERT1 Extracellular signal-regulated kinase 2 MAP kinase 1 MAP kinase ERK2 MAPK 2 Mapk Mitogen-activated protein kinase 2 p42 | p42-MAPK
Type:
Protein
Mol. Mass.:
41278.65
Organism:
Mus musculus (Mouse)
Description:
P63085
Residue:
358
  
Inhibitor
Name:
BDBM176679
Synonyms:
US9115122, SS-1-019
Type:
Small organic molecule
Emp. Form.:
C18H18ClN5O2S2
Mol. Mass.:
435.951
SMILES:
CCOc1ccc(\C=C2/SC(=S)N(CCNc3nc(C)nc(Cl)n3)C2=O)cc1
: