Target
Mitogen-activated protein kinase 1
Ligand
BDBM176677
Substrate
Meas. Tech.
Fluorescence Quenching Assay
Kd
6000±1500 nM
Citation
 Shapiro, PSMacKerell, Jr., ADFletcher, S Non-ATP dependent inhibitors of extracellular signal-regulated kinase (ERK) US Patent  US9115122 Publication Date 8/25/2015 
Target
Name:
Mitogen-activated protein kinase 1
Synonyms:
ERT1 Extracellular signal-regulated kinase 2 MAP kinase 1 MAP kinase ERK2 MAPK 2 Mapk Mitogen-activated protein kinase 2 p42 | p42-MAPK
Type:
Protein
Mol. Mass.:
41278.65
Organism:
Mus musculus (Mouse)
Description:
P63085
Residue:
358
  
Inhibitor
Name:
BDBM176677
Synonyms:
US9115122, SF-2-062
Type:
Small organic molecule
Emp. Form.:
C22H22N2O4S2
Mol. Mass.:
442.551
SMILES:
CCOc1ccc(\C=C2/SC(=S)N(CCNCc3ccc(cc3)C(O)=O)C2=O)cc1
: