Target
Maternal embryonic leucine zipper kinase
Ligand
BDBM177322
Substrate
Meas. Tech.
Kinase Assay
pH
7.4±n/a
Temperature
298.15±n/a K
IC50
3.2±n/a nM
Comments
extracted
Citation
 Matsuo, YHisada, SNakamura, YAhmed, FHuntley, RWalker, JRDecornez, H Quinoline derivatives and MELK inhibitors containing the same US Patent  US9120749 Publication Date 9/1/2015 
Target
Name:
Maternal embryonic leucine zipper kinase
Synonyms:
KIAA0175 MELK_HUMAN Maternal embryonic leucine zipper kinase (MELK)
Type:
Enzyme
Mol. Mass.:
74665.45
Organism:
Homo sapiens (Human)
Description:
Q14680
Residue:
651
  
Inhibitor
Name:
BDBM177322
Synonyms:
US9120749, 688
Type:
Small organic molecule
Emp. Form.:
C28H28ClN5O3
Mol. Mass.:
518.007
SMILES:
COc1cc(cc(Cl)c1O)-c1ccc2ncc(C(C)=O)c(Nc3ccc(nc3)N3CCCC(N)C3)c2c1
: