Target
Maternal embryonic leucine zipper kinase
Ligand
BDBM177366
Substrate
Meas. Tech.
Kinase Assay
pH
7.4±n/a
Temperature
298.15±n/a K
IC50
1.7±n/a nM
Comments
extracted
Citation
 Matsuo, YHisada, SNakamura, YAhmed, FHuntley, RWalker, JRDecornez, H Quinoline derivatives and MELK inhibitors containing the same US Patent  US9120749 Publication Date 9/1/2015 
Target
Name:
Maternal embryonic leucine zipper kinase
Synonyms:
KIAA0175 MELK_HUMAN Maternal embryonic leucine zipper kinase (MELK)
Type:
Enzyme
Mol. Mass.:
74665.45
Organism:
Homo sapiens (Human)
Description:
Q14680
Residue:
651
  
Inhibitor
Name:
BDBM177366
Synonyms:
US9120749, 732 | US9120749, 733
Type:
Small organic molecule
Emp. Form.:
C27H25ClFN5O2
Mol. Mass.:
505.971
SMILES:
CC(=O)c1cnc2ccc(cc2c1Nc1ccc(nc1)N1CCCC(N)C1)-c1cc(F)c(O)c(Cl)c1
: