Target
Maternal embryonic leucine zipper kinase
Ligand
BDBM177372
Substrate
Meas. Tech.
Kinase Assay
pH
7.4±n/a
Temperature
298.15±n/a K
IC50
2.6±n/a nM
Comments
extracted
Citation
 Matsuo, YHisada, SNakamura, YAhmed, FHuntley, RWalker, JRDecornez, H Quinoline derivatives and MELK inhibitors containing the same US Patent  US9120749 Publication Date 9/1/2015 
Target
Name:
Maternal embryonic leucine zipper kinase
Synonyms:
KIAA0175 MELK_HUMAN Maternal embryonic leucine zipper kinase (MELK)
Type:
Enzyme
Mol. Mass.:
74665.45
Organism:
Homo sapiens (Human)
Description:
Q14680
Residue:
651
  
Inhibitor
Name:
BDBM177372
Synonyms:
US9120749, 738
Type:
Small organic molecule
Emp. Form.:
C28H34ClN3O3
Mol. Mass.:
496.041
SMILES:
COc1cc(cc(Cl)c1O)-c1ccc2ncc(C(C)=O)c(N[C@H]3CC[C@H](CCN(C)C)CC3)c2c1
: