Target
Focal adhesion kinase 1
Ligand
BDBM176596
Substrate
Meas. Tech.
Biacore SPR Assay
pH
7.4±n/a
Kd
0.79±n/a nM
Comments
extracted
Citation
 Holmes, IPBergman, YLunniss, GENikac, MChol, NHemley, CFWalker, SRFoitzik, RCGaname, DLessene, R Selective FAK inhibitors US Patent  US9120761 Publication Date 9/1/2015 
Target
Name:
Focal adhesion kinase 1
Synonyms:
FAK1_MOUSE Fak Focal adhesion kinase (FAK) Ptk2
Type:
Enzyme
Mol. Mass.:
123537.99
Organism:
Mus musculus (Mouse)
Description:
P34152
Residue:
1052
  
Inhibitor
Name:
BDBM176596
Synonyms:
US9120761, 10
Type:
Small organic molecule
Emp. Form.:
C27H27F6N5O2
Mol. Mass.:
567.526
SMILES:
NC(=O)Cc1ccccc1CCc1nc(Nc2ccc(cc2OC(F)(F)F)C2CCNCC2)ncc1C(F)(F)F
: