Target
Urease
Ligand
BDBM178021
Substrate
Meas. Tech.
Urease Inhibition Assay
pH
8.2±n/a
IC50
58± 11 nM
Comments
extracted
Citation
 Saeed, AMahmood, SURafiq, MAshraf, ZJabeen, FSeo, SY Iminothiazoline-Sulfonamide Hybrids as Jack Bean Urease Inhibitors; Synthesis, Kinetic Mechanism and Computational Molecular Modeling. Chem Biol Drug Des 87:434-43 (2016)  
Target
Name:
Urease
Synonyms:
UREA_CANEN | Urea amidohydrolase
Type:
Enzyme
Mol. Mass.:
90746.20
Organism:
Canavalia ensiformis (Jack bean) (Horse bean)
Description:
P07374
Residue:
840
  
Inhibitor
Name:
BDBM178021
Synonyms:
(Z)-N-(3-(4-aminosulfonylphenyl)-4-methylthiazol-2(3H)-ylidene)-2-chloro-4-nitrobenzamide (3i)
Type:
Small organic molecule
Emp. Form.:
C17H13ClN4O5S2
Mol. Mass.:
452.892
SMILES:
Cc1cs\c(=N/C(=O)c2ccc(cc2Cl)[N+]([O-])=O)n1-c1ccc(cc1)S(N)(=O)=O
: