Target
Beta-lactamase TEM
Ligand
BDBM178205
Substrate
Meas. Tech.
Cell Free Inhibition Assay
pH
7±n/a
Temperature
310.15±n/a K
IC50
1948.6±n/a nM
Comments
extracted
Citation
 Bulusu, AR Substituted clavulanic acid US Patent  US9120808 Publication Date 9/1/2015 
Target
Name:
Beta-lactamase TEM
Synonyms:
BLAT_ECOLX Beta-lactamase (TEM-1) Beta-lactamase TEM-1 Beta-lactamase TEM1D Beta-lactamase TEM1F TEM extended-spectrum beta-lactamase bla
Type:
Enzyme
Mol. Mass.:
31512.33
Organism:
Escherichia coli
Description:
P62593
Residue:
286
  
Inhibitor
Name:
BDBM178205
Synonyms:
US9120808, Example 38 | US9120808, Example 38a
Type:
Small organic molecule
Emp. Form.:
C18H19NO5
Mol. Mass.:
329.3472
SMILES:
OCC(CC=C)=C1O[C@@H]2CC(=O)N2C1C(=O)OCc1ccccc1
: