Target
Beta-lactamase SHV-1
Ligand
BDBM178207
Substrate
Meas. Tech.
Cell Free Inhibition Assay
pH
7±n/a
Temperature
310.15±n/a K
IC50
5609.9±n/a nM
Comments
extracted
Citation
 Bulusu, AR Substituted clavulanic acid US Patent  US9120808 Publication Date 9/1/2015 
Target
Name:
Beta-lactamase SHV-1
Synonyms:
BLA1_ECOLX bla | shv1
Type:
Enzyme
Mol. Mass.:
31226.68
Organism:
Escherichia coli
Description:
P0AD63
Residue:
286
  
Inhibitor
Name:
BDBM178207
Synonyms:
US9120808, Example 39
Type:
Small organic molecule
Emp. Form.:
C24H23NO5
Mol. Mass.:
405.4431
SMILES:
OCC(CC=Cc1ccccc1)=C1O[C@@H]2CC(=O)N2C1C(=O)OCc1ccccc1
: