Target
Apoptosis regulator Bcl-2
Ligand
BDBM178862
Substrate
Meas. Tech.
Time Resolved-Fluorescence Resonance Energy Transfer (TR-FRET) Assay
Ki
0.052±n/a nM
Citation
 Bruncko, MDing, HDoherty, GAElmore, SWHasvold, LHexamer, LAKunzer, ARMantei, RAMcClellan, WJPark, CHPark, CPetros, AMSong, XSouers, AJSullivan, GMTao, ZWang, GTWang, LWang, XWendt, MD Bcl-2-selective apoptosis-inducing agents for the treatment of cancer and immune diseases US Patent  US9125913 Publication Date 9/8/2015 
Target
Name:
Apoptosis regulator Bcl-2
Synonyms:
BCL2_MOUSE Bcl2
Type:
Protein
Mol. Mass.:
26409.44
Organism:
Mus musculus (Mouse)
Description:
P10417
Residue:
236
  
Inhibitor
Name:
BDBM178862
Synonyms:
US9125913, 434
Type:
Small organic molecule
Emp. Form.:
C45H49Cl2F2N7O5S
Mol. Mass.:
908.882
SMILES:
CC1(C)CCC(CN2CCN(CC2)c2ccc(C(=O)NS(=O)(=O)c3cnc(O[C@@H]4CCN(C4)C(CF)CF)c(Cl)c3)c(Oc3cccc4[nH]ncc34)c2)=C(C1)c1ccc(Cl)cc1
: