Target
ALK tyrosine kinase receptor
Ligand
BDBM178925
Substrate
Meas. Tech.
Inhibition Assay
IC50
2.9±n/a nM
Citation
 Kinoshita, KAsoh, KFuruichi, NIto, TKawada, HIshii, NSakamoto, HHong, WPark, MOno, YKato, YMorikami, KEmura, TOikawa, N Tetracyclic compound US Patent  US9126931 Publication Date 9/8/2015 
Target
Name:
ALK tyrosine kinase receptor
Synonyms:
ALK ALK_HUMAN CD_antigen: CD246
Type:
Protein
Mol. Mass.:
176453.10
Organism:
Homo sapiens (Human)
Description:
Q9UM73
Residue:
1620
  
Inhibitor
Name:
BDBM178925
Synonyms:
US9126931, 65
Type:
Small organic molecule
Emp. Form.:
C28H29N3O3
Mol. Mass.:
455.5482
SMILES:
CC1(C)c2[nH]c3cc(ccc3c2C(=O)c2ccc(OCC3CCN(CC3)C3COC3)cc12)C#N
: