Target
Apoptosis regulator Bcl-2
Ligand
BDBM179558
Substrate
Meas. Tech.
Surface plasmon resonance (SPR)
IC50
126.56±n/a nM
Citation
 Visser, MSYusuff, N Compounds for inhibiting the interaction of BCL2 with binding partners US Patent  US9126980 Publication Date 9/8/2015 
Target
Name:
Apoptosis regulator Bcl-2
Synonyms:
Apoptosis regulator Bcl-2 Protein BCL-2 BCL2_HUMAN | Bcl-2 Protein
Type:
Homodimer or heterodimer
Mol. Mass.:
26269.11
Organism:
Homo sapiens (Human)
Description:
P10415
Residue:
239
  
Inhibitor
Name:
BDBM179558
Synonyms:
US9126980, 3
Type:
Small organic molecule
Emp. Form.:
C33H45N5O5S
Mol. Mass.:
623.806
SMILES:
CCCCN(CCCC)C(=O)c1cc(C)n(n1)-c1ccc(NS(=O)(=O)C(C)C)cc1C(=O)N1Cc2ccccc2C[C@H]1CO
: