Target
Apoptosis regulator Bcl-2
Ligand
BDBM179587
Substrate
Meas. Tech.
Surface plasmon resonance (SPR)
IC50
631.485±n/a nM
Citation
 Visser, MSYusuff, N Compounds for inhibiting the interaction of BCL2 with binding partners US Patent  US9126980 Publication Date 9/8/2015 
Target
Name:
Apoptosis regulator Bcl-2
Synonyms:
Apoptosis regulator Bcl-2 Protein BCL-2 BCL2_HUMAN | Bcl-2 Protein
Type:
Homodimer or heterodimer
Mol. Mass.:
26269.11
Organism:
Homo sapiens (Human)
Description:
P10415
Residue:
239
  
Inhibitor
Name:
BDBM179587
Synonyms:
US9126980, 32
Type:
Small organic molecule
Emp. Form.:
C38H45N5O6S
Mol. Mass.:
699.859
SMILES:
CCCCN(CCCC)C(=O)c1cc(C)n(n1)-c1ccc(NS(=O)c2ccc3OCCOc3c2)cc1C(=O)N1Cc2ccccc2C[C@H]1CO
: