Target
Glucose-dependent insulinotropic receptor
Ligand
BDBM180505
Substrate
Meas. Tech.
AlphaScreen cAMP Assay
pH
7.4±n/a
Temperature
310.15±n/a K
EC50
51±n/a nM
Comments
extracted
Citation
 Grauert, MBakker, RBreitfelder, SBuettner, FEickelmann, PFox, TGrundl, MLehmann-Lintz, TRist, W Benzoxazole- and tetrahydrobenzoxazole-substituted pyridazinones as GPR119 agonists US Patent  US8772323 Publication Date 7/8/2014 
Target
Name:
Glucose-dependent insulinotropic receptor
Synonyms:
G-protein coupled receptor 119 (GPR119) GPR119 | Glucose-dependent insulinotropic receptor
Type:
Protein
Mol. Mass.:
36901.49
Organism:
Homo sapiens (Human)
Description:
Q8TDV5
Residue:
335
  
Inhibitor
Name:
BDBM180505
Synonyms:
US8772323, 67
Type:
Small organic molecule
Emp. Form.:
C30H36N4O5
Mol. Mass.:
532.6306
SMILES:
CCC1CC(=O)NN=C1c1ccc2nc(oc2c1)-c1ccc(OCC2CCN(CC2)C(=O)OC(C)(C)C)cc1
: