Target
Glucose-dependent insulinotropic receptor
Ligand
BDBM180559
Substrate
Meas. Tech.
AlphaScreen cAMP Assay
pH
7.4±n/a
Temperature
310.15±n/a K
EC50
1146±n/a nM
Comments
extracted
Citation
 Grauert, MBakker, RBreitfelder, SBuettner, FEickelmann, PFox, TGrundl, MLehmann-Lintz, TRist, W Benzoxazole- and tetrahydrobenzoxazole-substituted pyridazinones as GPR119 agonists US Patent  US8772323 Publication Date 7/8/2014 
Target
Name:
Glucose-dependent insulinotropic receptor
Synonyms:
G-protein coupled receptor 119 (GPR119) GPR119 | Glucose-dependent insulinotropic receptor
Type:
Protein
Mol. Mass.:
36901.49
Organism:
Homo sapiens (Human)
Description:
Q8TDV5
Residue:
335
  
Inhibitor
Name:
BDBM180559
Synonyms:
US8772323, 86
Type:
Small organic molecule
Emp. Form.:
C19H17N3O3
Mol. Mass.:
335.3566
SMILES:
COc1ccccc1-c1nc2ccc(cc2o1)C1=NNC(=O)CC1C
: